2026-10-19 15:47:50,317 INFO catalog: === tissot: 569 discovered, mode=full workers=2 render=False wait=None === 2026-10-19 15:47:54,894 ERROR nx: FAILED https://www.tissotwatches.com/en-us/T0062071109600.html: guard failed: sentinel 'THIS_STRING_IS_NOT_ON_THE_PAGE' absent in 10515 bytes 2026-10-19 15:47:58,394 ERROR nx: FAILED https://www.tissotwatches.com/en-us/T1214204705105.html: guard failed: sentinel 'THIS_STRING_IS_NOT_ON_THE_PAGE' absent in 5924 bytes 2026-10-19 15:47:58,395 INFO catalog: progress 2/2 ok=0 failed=2 filtered=0 (8s) 2026-10-19 15:47:58,396 ERROR catalog: FAILURE RATE 100% (2/2) exceeds 50% — exit 1 2026-10-19 15:47:58,397 INFO catalog: failed URLs written to logs/run3.failed.txt 2026-10-19 15:47:58,397 INFO catalog: === DONE tissot ok=0 failed=2 filtered=0 skipped=0 billed_requests=2 exit=1 out=output/brands/tissot_bad.csv ===